URL,Title,Phone,Website,"Business Categories","Complete Address","Street Address",City,State,"Zip Code",Country,Rating,"Payment Methods",Hours,Facebook,Twitter,Youtube,Instagram,"Products and Services",Specialties,Description
https://www.yellowpages.ca/bus/Ontario/Sam-s-Painting/100001391.html,"Sam's Painting",416-254-2728,,"Painters, Painters in ON, Painters in One Toronto Core West, Painters in Etobicoke, Painters in One Toronto Core SE, Painters in One Toronto Core NE, Painters in Scarborough",,,,,,Canada,,,,,,,,,,
https://www.yellowpages.ca/bus/Quebec/Saint-Hyacinthe/Jacques-Lavimodiere-Garage/100001480.html,"Jacques Lavimodière Garage",450-773-9227,,"Auto Repair Garages, Auto Repair Garages in QC, Auto Repair Garages in Saint-Hyacinthe","6490, rue Frontenac, Saint-Hyacinthe, QC J2S 7A9","6490, rue Frontenac",Saint-Hyacinthe,QC,"J2S 7A9",Canada,,"Visa, Mastercard, Cash, Interac","Monday => 8:00 am - 5:00 pm || Tuesday => 8:00 am - 5:00 pm || Wednesday => 8:00 am - 5:00 pm || Thursday => 8:00 am - 5:00 pm || Friday => 8:00 am - 5:00 pm",,,,,"Preventive Car Maintenance, Muffler Repair, Clutch Repair, Car Tune-up, Car Tire Rotation, Car Tire Balancing, Car Suspension Repair, Car Shock Repair, Car Radiator Repair, Car Oil Change, Car Exhaust Systems Repair, Car Electrical System Repair, Car Cool",,
https://www.yellowpages.ca/bus/Manitoba/Reliable-Heating-Air-Conditioning-Ltd/100002480.html,"Reliable Heating & Air Conditioning Ltd",204-888-0838,,"Ventilation Contractors, Ventilation Contractors in MB, Ventilation Contractors in Winnipeg",,,,,,Canada,,,,,,,,"heating contractor",,
https://www.yellowpages.ca/bus/Ontario/Carp/BrickMarket-Inc/100002652.html,"BrickMarket Inc",613-831-4366,,"Masonry & Bricklaying Contractors, Masonry & Bricklaying Contractors in ON, Masonry & Bricklaying Contractors in Carp","86 Cardevco Rd RR 2, Carp, ON K0A 1L0","86 Cardevco Rd RR 2",Carp,ON,"K0A 1L0",Canada,,,,,,,,,,
https://www.yellowpages.ca/bus/Ontario/Dor-X-Painting/100002675.html,"Dor X Painting",416-729-0651,,"Painters, Painters in ON, Painters in One Toronto Core West, Painters in Etobicoke, Painters in One Toronto Core SE, Painters in Toronto, Painters in North York, Painters in One Toronto Core Centre, Painters in One Toronto Core NE, Painters in Scarborough",,,,,,Canada,,,,,,,,,,
https://www.yellowpages.ca/bus/British-Columbia/Power-Building-Supplies/100003492.html,"Power Building Supplies",604-941-5546,https://www.facebook.com/pages/Poco-Building-Supplies/93006400870,"Construction Materials & Building Supplies, Construction Materials & Building Supplies in BC, Construction Materials & Building Supplies in Coquitlam",,,,,,Canada,,,,,,,,,,
https://www.yellowpages.ca/bus/British-Columbia/Ekistics-Architecture-Inc/100003795.html,"Ekistics Architecture Inc",604-876-5060,,"Architects, Architects in BC, Architects in Vancouver",,,,,,Canada,,,,,,,,,,
https://www.yellowpages.ca/bus/British-Columbia/Burnaby/Gala-Custom-Cabinets-Ltd/100004808.html,"Gala Custom Cabinets Ltd",604-433-1231,http://www.facebook.com/pages/Gala-Custom-Cabinets/151419668219231,"Kitchen Cabinets, Kitchen Cabinets in BC, Kitchen Cabinets in Burnaby, Kitchen Cabinets in Burnaby South","8783 Greenall Ave, Burnaby, BC V5J 3M9","8783 Greenall Ave",Burnaby,BC,"V5J 3M9",Canada,,,"Monday => 9:30 am - 6:30 pm || Tuesday => 9:30 am - 6:30 pm || Wednesday => 9:30 am - 6:30 pm || Thursday => 9:30 am - 6:30 pm || Friday => 9:30 am - 6:30 pm",,,,,,,
https://www.yellowpages.ca/bus/Alberta/Walker-Lawson-Interior-Design-Inc/100005332.html,"Walker Lawson Interior Design Inc",403-261-0018,,"Interior Designers, Interior Designers in AB, Interior Designers in Calgary",,,,,,Canada,,"Mastercard, Visa",,,,,,,,
https://www.yellowpages.ca/bus/Alberta/Edmonton/SP-Plus-Corporation-Canada/100005369.html,"SP Plus Corporation Canada",780-428-4264,,"Parking Lots & Garages, Parking Lots & Garages in AB, Parking Lots & Garages in Edmonton, Parking Lots & Garages in Downtown","10180 101 Street NW, Edmonton, AB T5J 3S4","10180 101 Street NW",Edmonton,AB,"T5J 3S4",Canada,,,,,,,,,,
https://www.yellowpages.ca/bus/Ontario/Toronto/Hestia-International-Inc/100005665.html,"Hestia International Inc",416-869-0770,http://www.hestiainternational.com/,"Baby Furniture Stores, Baby Furniture Stores in ON, Baby Furniture Stores in Toronto, Baby Furniture Stores in Downtown, Toy Stores, Toy Stores in ON, Toy Stores in Toronto, Toy Stores in Downtown, Baby Products & Accessories, Baby Products & Acce","130 Spadina Ave, Toronto, ON M5V 2L4","130 Spadina Ave",Toronto,ON,"M5V 2L4",Canada,,,"Monday => 12:00 am - 11:59 pm || Tuesday => 12:00 am - 11:59 pm || Wednesday => 12:00 am - 11:59 pm || Thursday => 12:00 am - 11:59 pm || Friday => 12:00 am - 11:59 pm || Saturday => 12:00 am - 11:59 pm || Sunday => 12:00 am - 11:59 p",,,,,print,,"Hestia International Inc. is an innovative marketing, publishing and media sales company operating in Toronto, Canada, servicing a wide array of industries worldwide. Hestia International is committed to providing high quality, up to date and relevant marketing solutions for today's advertiser."
https://www.yellowpages.ca/bus/Ontario/Maid-Your-Way/1000057.html,"Maid Your Way",416-452-8753,http://www.maidyourway.com/,"Commercial, Industrial & Residential Cleaning, Commercial, Industrial & Residential Cleaning in ON, Commercial, Industrial & Residential Cleaning in One Toronto Core West, Commercial, Industrial & Residential Cleaning in Etobicoke, Commerc",,,,,,Canada,,,"Monday => 7:00 am - 8:30 pm || Tuesday => 7:00 am - 8:30 pm || Wednesday => 7:00 am - 8:30 pm || Thursday => 7:00 am - 8:30 pm || Friday => 7:00 am - 8:30 pm",,,,,,,"Maid Your Way is a residential and commercial cleaning service for the Boone, Blowing Rock, Zionville, and Valle Crucis area. We strive to provide the best customer service possible. We take our business very seriously and are constantly working to provide the best products possible. Our cleaning products are Green Seal Certified. Our vacuums have hepa-filtration and leave your home lightly scented with 100% pure essential oils."
https://www.yellowpages.ca/bus/British-Columbia/Hoban-Equipment/100006163.html,"Hoban Equipment",250-836-4246,http://hobanequipment.com/,"Snow Removal Equipment, Snow Removal Equipment in BC, Snow Removal Equipment in Salmon Arm-Revelstoke",,,,,,Canada,,,,,,,,,,
https://www.yellowpages.ca/bus/Ontario/Broken-Springs-Garage-Door-Specialist/100006484.html,"Broken Springs Garage Door Specialist",416-223-0622,,"Garage Door Openers, Garage Door Openers in ON, Garage Door Openers in One Toronto Core West, Garage Door Openers in Etobicoke, Garage Door Openers in One Toronto Core SE, Garage Door Openers in Toronto, Garage Door Openers in One Toronto Core Centre, Gar",,,,,,Canada,,,,,,,,,,
https://www.yellowpages.ca/bus/Alberta/Gibbs-L-Wade/100006490.html,"Gibbs L Wade",403-264-2077,,"Auto Repair Self Service Garages, Auto Repair Self Service Garages in AB, Auto Repair Self Service Garages in Calgary",,,,,,Canada,,,,,,,,,,
https://www.yellowpages.ca/bus/New-Brunswick/Riverview/Maid-Exec/1000067.html,Maid-Exec,506-804-3079,,"Janitorial Service, Janitorial Service in NB, Janitorial Service in Riverview, Commercial, Industrial & Residential Cleaning, Commercial, Industrial & Residential Cleaning in NB, Commercial, Industrial & Residential Cleaning in Riverview","10 Dale St, Riverview, NB E1B 4A9","10 Dale St",Riverview,NB,"E1B 4A9",Canada,,"Visa, Mastercard, Cash, Interac, American Express","Monday => 9:00 am - 5:00 pm || Tuesday => 9:00 am - 5:00 pm || Wednesday => 9:00 am - 5:00 pm || Thursday => 9:00 am - 5:00 pm || Friday => 9:00 am - 5:00 pm",,,,,"In Home Cleaning, References Available, Free Estimates, Daily- Weekly And Monthly Fees, Bonded And Insured, Commercial And Office Cleaning, Basic - Complete Janitorial Service, Basic - Complete Janitorial Service","Residential Cleaning, Office Cleaning, Day To Day Janitorial Service, Competitive Quotes, Commercial Cleaning","Maid Exec, 27 years of experience, long reference list, professional, 24/7 communication, free quotes."
https://www.yellowpages.ca/bus/Alberta/Chancelot-Concrete-Restoration-Ltd/100007182.html,"Chancelot Concrete Restoration Ltd",780-476-6718,,"Concrete Repair, Sealing & Restoration, Concrete Repair, Sealing & Restoration in AB, Concrete Repair, Sealing & Restoration in Edmonton",,,,,,Canada,,,,,,,,,,
https://www.yellowpages.ca/bus/Ontario/Toronto/Key-2-Communications-Inc/100007381.html,"Key 2 Communications Inc",416-798-7175,,"Mechanical Contractors, Mechanical Contractors in ON, Mechanical Contractors in Toronto, Mechanical Contractors in Parkdale","219 Dufferin St, Toronto, ON M6K 3J1","219 Dufferin St",Toronto,ON,"M6K 3J1",Canada,,,,,,,,,,
https://www.yellowpages.ca/bus/Ontario/Toronto-Locksmith-Pro/100007621.html,"Toronto Locksmith Pro",416-619-0085,,"Locksmiths & Locks, Locksmiths & Locks in ON, Locksmiths & Locks in One Toronto Core West, Locksmiths & Locks in Toronto, Locksmiths & Locks in One Toronto Core Centre, Locksmiths & Locks in North York, Locksmiths & Locks in Sc",,,,,,Canada,,,,,,,,,,
https://www.yellowpages.ca/bus/Ontario/Roto-Rooter-Plumbing-Drain-Service/100007808.html,"Roto-Rooter Plumbing & Drain Service",519-900-5800,,"Plumbers & Plumbing Contractors, Plumbers & Plumbing Contractors in ON, Plumbers & Plumbing Contractors in Brantford",,,,,,Canada,,"Visa, Mastercard, Cash, Interac, American Express","Monday => 9:00 am - 5:00 pm || Tuesday => 9:00 am - 5:00 pm || Wednesday => 9:00 am - 5:00 pm || Thursday => 9:00 am - 5:00 pm || Friday => 9:00 am - 5:00 pm || Emergency Appointments Available =>",,,,,"Clogged Drain, Plumbing And Heating, Residential Plumbing, Home Plumbing, Plumbing Installation, Plumbing Maintenance, Plumbing Repair, Drain Installation, Drain Maintenance, Drain Pipe Repair, Plumbing Repair, Drain Installation, Drain Maintenance, Drain","EMERGENCY PLUMBING, WATER CLEAN UP RESTORATION, COMMERCIAL PLUMBING, RESIDENTIAL PLUMBING","24 Hours A Day/7 Days A Week, Call Roto-Rooter Plumbers For All Of Your Drain & Plumbing Problems. Licensed & Insured.Roto-Rooter plumbers in St Catharines provide full-service plumbing maintenance and repairs 24 hours a day, seven days a week. From drain cleaning to installations, new lines to emergency services, our team will be there when you need us most. Trusted and recommended since 1935, Roto-Rooter is the premier provider of plumbing and drain cleaning services in St Catharines. Because we live and work in the community, our team not only understands the needs of local residents – and their homes – but is educated in local zoning and infrastructure. To ensure you receive the services you need when you need them, our customer service representative are well trained and can either book your appointment or, in the event of an emergency, immediately dispatch a St Catharines plumber to your home or business. To schedule your appointment, call us at 905-687-3900 or book your appointment online. Our Specialty is Emergency Services"
https://www.yellowpages.ca/bus/Ontario/Mississauga/Abraxis-Home-Services/100008029.html,"Abraxis Home Services",647-213-2667,http://abraxispainting.ca/page/home,"Painters, Painters in ON, Painters in Mississauga","9-167 Queen St S, Mississauga, ON L5M 1L2","9-167 Queen St S",Mississauga,ON,"L5M 1L2",Canada,,"Cheque, Cash, Email transfer, Certified Cheque, PayPal, American Express, Mastercard, Interac, Visa","Monday => 7:00 am - 8:00 pm || Tuesday => 7:00 am - 8:00 pm || Wednesday => 7:00 am - 8:00 pm || Thursday => 7:00 am - 8:00 pm || Friday => 7:00 am - 8:00 pm || Saturday => 7:00 am - 8:00 pm || Sunday => 7:00 am - 8:00 pm",,,,,"Faux Finish, Fine Finish Spraying, Interior Painting, Staging Painting, Drywall, Siding Painting, Staircase Refinishing, Kitchen Painting, Interior Design, Exterior Painting, Staining, Bathroom Painting, Cabinet Refinishing, Ceiling Painting, Carpentry, H","Accountability & Reliabilty, Interior Design, Drywall Repairs, High Quality Interior Painting, Staircase Refinishing, High Quality Exterior Painting, Customer Service, Cabinet Refinishing, Fine Finish Spray Painting, Staging, Customer Service, Cabinet","Abraxis Painting welcomes all homeowners and clients from many parts of the home improvement industry. Abraxis Painting is a full service PAINTING CONTRACTOR, capable of producing high quality and high detail residential projects that fit your budget and deadlines. Specializing in customer service, we ensure that every customer that chooses Abraxis is fully satisfied with the finished product and feels confident in referring their family and friends to our organization. Free Colour Consultations Free Paint Samples Free Design and Staging Photography"
https://www.yellowpages.ca/bus/British-Columbia/Island-Slipform-Inc/100008050.html,"Island Slipform Inc",250-478-4510,,"General Contractors, General Contractors in BC, General Contractors in Victoria, General Contractors in Colwood",,,,,,Canada,,,,,,,,,,
https://www.yellowpages.ca/bus/Ontario/Kitchener/Davey-Tree-Expert-Co-Of-Canada-Ltd/100008967.html,"Davey Tree Expert Co Of Canada Ltd",226-243-1242,,"Tree Service, Tree Service in ON, Tree Service in Kitchener",,,,,,Canada,,"Visa, Mastercard, Cheque","Monday => 8:00 am - 5:00 pm || Tuesday => 8:00 am - 5:00 pm || Wednesday => 8:00 am - 5:00 pm || Thursday => 8:00 am - 5:00 pm || Friday => 8:00 am - 5:00 pm || 24 Hours Emergency Service Available =>",,,,,"Commercial Tree Service, Emergency Tree Service, Dangerous Tree Assessment, Certified Arborists, Tree And Shrub Fertilization, Insect And Disease Management, Emerald Ash Borer Management, Cabling And Bracing, Crown Reduction, Hedge Trimming, Stump Grindin","Emerald Ash Borer Management, Insect And Disease Management, Residential Tree Work, Tree And Shrub Fertilization, Dangerous Tree Assessment","Davey has been Canada’s professional tree service since 1880. From the GTA to Vancouver, we help residential, commercial and municipal clients care for their trees and shrubs and manage their green assets. As Consumer Choice Award recipient for Business Excellence in many markets, we understand the value of great client service. Our arborists live in the communities we serve and as employee owners, share the company’s success locally. Whether our arborists are helping a family in Victoria care for their favourite tree, providing Hydro in Calgary with storm response mobilization and post-storm support, assessing and maintaining the trees at a community park in Ottawa or providing an arborist report for a municipality in the GTA, our commitment to delivering the highest quality tree service and urban forestry consulting remains the same."
https://www.yellowpages.ca/bus/Nova-Scotia/Halifax/The-Maids/1000101.html,"The Maids",902-708-8356,,"Maid & Butler Service, Maid & Butler Service in NS, Maid & Butler Service in Halifax, Commercial, Industrial & Residential Cleaning, Commercial, Industrial & Residential Cleaning in NS, Commercial, Industrial & Residential Cleaning","103-51 Cobequid Road, Halifax, NS B4C 2N1","103-51 Cobequid Road",Halifax,NS,"B4C 2N1",Canada,,"Visa, Mastercard, Cash, Interac, American Express","Monday => 9:00 am - 5:00 pm || Tuesday => 9:00 am - 5:00 pm || Wednesday => 9:00 am - 5:00 pm || Thursday => 9:00 am - 5:00 pm || Friday => 9:00 am - 5:00 pm",,,,,"Cleaning Lady, Bi-weekly Cleaning, Fall Cleaning, Bathroom Cleaning, Bedroom Cleaning, Apartment Cleaning, Daily Cleaning, House Cleaning, Housekeeping Service, Weekly Cleaning, Moving Cleaning, Deep Cleaning, Monthly Cleaning, Disinfection, Vacuuming Ser",,"Is your Lower Sackville home in shambles? Let The Maids clean up your mess and make your home sparkling and fresh, from top to bottom. Our professional housekeepers are bonded, insured and have had extensive background checks. We are referred for a reason. We give an incredible clean using heavy duty, environmentally friendly cleaners and a magic touch on everything from carpets to corners, nooks and crannies. Experience a professional clean from a team who are passionate about neat and tidiness. Call us today for your estimate."
https://www.yellowpages.ca/bus/Ontario/Alex-Plumbing/100010313.html,"Alex Plumbing",416-657-7584,,"Plumbers & Plumbing Contractors, Plumbers & Plumbing Contractors in ON, Plumbers & Plumbing Contractors in Etobicoke, Plumbers & Plumbing Contractors in Richmond Hill",,,,,,Canada,,,,,,,,,,
https://www.yellowpages.ca/bus/Ontario/Bowery-Designs/100010347.html,"Bowery Designs",613-393-8993,,"Architectural & Construction Specifications, Architectural & Construction Specifications in ON, Architectural & Construction Specifications in Picton",,,,,,Canada,,,,,,,,,,
https://www.yellowpages.ca/bus/Ontario/York/Paul-s-Service-Center/100010748.html,"Paul's Service Center",416-762-2777,,"Auto Repair Garages, Auto Repair Garages in ON, Auto Repair Garages in York","350 Weston Rd, York, ON M6N 3P9","350 Weston Rd",York,ON,"M6N 3P9",Canada,,,,,,,,,,
https://www.yellowpages.ca/bus/British-Columbia/Starline-Windows-2001-Ltd/100010863.html,"Starline Windows (2001) Ltd",250-390-3335,http://www.starlinewindows.com/,"Vinyl Windows, Vinyl Windows in BC, Vinyl Windows in Nanaimo, Mirror & Glass Doors, Mirror & Glass Doors in BC, Mirror & Glass Doors in Nanaimo, Plastic Extrusion, Plastic Extrusion in BC, Plastic Extrusion in Nanaimo",,,,,,Canada,,,,,,,,"Building Materials, Local Business",,
https://www.yellowpages.ca/bus/Alberta/Jn-Roofing/100010944.html,"Jn Roofing",403-516-0886,,"Roofing Materials & Supplies, Roofing Materials & Supplies in AB, Roofing Materials & Supplies in Calgary",,,,,,Canada,,,,,,,,,,
https://www.yellowpages.ca/bus/British-Columbia/Sechelt/Lehigh-Materials/100011022.html,"Lehigh Materials",604-885-7595,https://www.lehighhanson.com/contact?s=quote&fid=ncabcf0005-sechelt-sand-and-gravel,"Sand & Gravel, Sand & Gravel in BC, Sand & Gravel in Sechelt, Concrete Additives, Concrete Additives in BC, Concrete Additives in Sechelt","5784 Sechelt Inlet Rd, Sechelt, BC V0N 3A3","5784 Sechelt Inlet Rd",Sechelt,BC,"V0N 3A3",Canada,,,"Monday => 7:00 am - 3:10 pm || Tuesday => 7:00 am - 3:10 pm || Wednesday => 7:00 am - 3:10 pm || Thursday => 7:00 am - 3:10 pm || Friday => 7:00 am - 3:10 pm",,,,,"Aggregate Sales, Aggregate Distribution, Sand And Gravel, Aggregates, Stone",,"Sand & Gravel Supplier"
https://www.yellowpages.ca/bus/Ontario/Toronto/DrainWorks/100011089.html,"DrainWorks Plumbing",416-486-0000,http://www.drainworks.com/,"Drainage Contractors, Drainage Contractors in ON, Drainage Contractors in Etobicoke, Plumbers & Plumbing Contractors, Plumbers & Plumbing Contractors in ON, Plumbers & Plumbing Contractors in Etobicoke","7-46 Fieldway Rd, Etobicoke, ON M8Z 3L2","7-46 Fieldway Rd",Etobicoke,ON,"M8Z 3L2",Canada,,"Mastercard, Cash, Interac, Visa","Monday => 8:00 am - 7:00 pm || Tuesday => 8:00 am - 7:00 pm || Wednesday => 8:00 am - 7:00 pm || Thursday => 8:00 am - 7:00 pm || Friday => 8:00 am - 7:00 pm || Saturday => 9:00 am - 4:00 pm || Sunday By Appointment Only =>",,,,,"Plumbing Contractors, Drainage Contractors, Backflow, Backwater Valve Installation, Burst Pipe, Drain Clogged With Tree Roots, Drain Pipe Repair, Frozen Pipe, Low Water Pressure, Piping, Pipe Cleaning, Drain Pipe Repair, Frozen Pipe, Low Water Pressure, P",,"DrainWorks Plumbing is Canadas Plumbing Authority, established in 1995 and has proudly served Toronto and the GTA for over 20 years. We take a different approach to Plumbing and Drains; one that is completely customer-focused. This is why we always offer clear up-front pricing with no hidden fees or surprises, and is the reason we only employ full time staff, not to mention that 95% of our staff has been with us for 10+ years. Our plumbers are fully licensed, insured and experienced. Because of our commitment to timely, friendly and knowledgeable service, we've twice been named best plumber in Toronto by Toronto Life Magazine, are a 6 time winner of the best of HomeStars award, and for 13 consecutive years, we had the honor of winning the Consumer Choice Award for drain service. Further, we are honored to have the distinction of being Baeumler Approved. This is something that very few companies can claim. When it comes to the integrity of your home, don’t take chances. Trust the DrainWorks team to professionally take care of all your plumbing needs, whether that be general home plumbing repairs, drain backups and clogs, preventative inspections and maintenance, waterproofing, hydrojetting, or same day plumbing needs. Remember, we’re always ready. Just give us a call at 416-486-0000 or book online via our website www.drainworks.com. We’ll be sure to answer quickly and be there when we say we will, equipped for the job. Come experience the BIG DrainWorks difference. We provide full service plumbing, same day emergency plumbing service, faucet installation, sink installation, toilet installation, faucet repairs, pipe installation, pipe repairs, drain installation, drain repairs, complete drain cleaning, snaking, camera scoping, underground sewer pipe replacement, waterproofing, hydrojetting, backwater valve installation, and much more."
https://www.yellowpages.ca/bus/British-Columbia/Ankenman-Marchand-Architects/100011099.html,"Ankenman Marchand Architects",604-876-4451,https://www.facebook.com/AnkenmanMarchandArchitects,"Architects, Architects in BC, Architects in Vancouver",,,,,,Canada,,,,,,,,,,
https://www.yellowpages.ca/bus/Ontario/Scarborough/Bluestream-Technologies-Inc/100011165.html,"Bluestream Technologies Inc",416-201-3099,,"Computer Repair & Cleaning, Computer Repair & Cleaning in ON, Computer Repair & Cleaning in Scarborough","171 Fallingbrook Rd, Scarborough, ON M1N 2V3","171 Fallingbrook Rd",Scarborough,ON,"M1N 2V3",Canada,,,,,,,,,,
https://www.yellowpages.ca/bus/Alberta/NU-Floors/100011187.html,"NU Floors",780-790-1991,,"Flooring Materials, Flooring Materials in AB, Flooring Materials in Fort McMurray",,,,,,Canada,,,,,,,,,,